Year,Jurisdiction,Jur_Name,Parcel_ID,Account,Location_Code,Jur1,Jur2,Jur 3,Jur 4,Jur 5,Jur 6,Jur 7,Jur 8,Jur 9,Jur 10,Jur 11,Jur 12,Is_Exempt,Prop_Street_Number,Prop_Street,Prop_Street_Dir,Prop_City,Prop_State,Prop_Zip5,Prop_Zip4,Owner_Id,Owner_Prefix,Name,Careof,Street,Street_Overflow,City,State,Zip5,Zip4,Interest,Ceiling_Year,Ceiling_Tax,Homestead_Code,Agent_Code,Acres,Legal1,Legal2,Legal3,Mortgage_Code,Land_Hs,Land_Nhs,Land_Productivity_Market,Land_1d1,Land_1d,Land_Timber,Personal_Hs,Personal_Nhs,Market_Value,Net_Taxable_Value,State_Homestead,State_Mandated_Over65,State_Mandated_Disabled,Optional65,Local_Disabled,Road_Homestead,Disabled_Veteran,New_Personal_Hs,New_Personal_Nhs,Improvement_Hs,New_Improvement_Hs,Improvement_Nhs,New_Improvement_Nhs,Is_Owner_Confidential,Local_Discount,Map1,Map2,Ownership_Sequence,Is_Protested,Has_Hs_Link,Primary_Category_Code,Secondary_Category_Code,Third_Category_Code,DBA,Has_Abatement,Has_Miscellaneous_Exemption,Name1,Legal4
2019,01,FRANKLIN CAD,1,02512-00000-00006-000000,FCMI,01,02,03,,34,02R,,,,,,,False,,,,,,,,31727,R,APPLEGATE DOUGLAS L,,793 FM 561,,SIMMS,TX,75574,,1.000000,0,0.00,,,0.0000,AB 217 J E HOPKINS,LT 6 UN 3 TALL TREE NORTH,,,0,1100,0,0,0,0,0,0,1100,1100,0,0,0,0,0,0,0,0,0,0,0,0,0,False,0,,,1,False,False,C1,,,,False,False,,
2019,01,FRANKLIN CAD,2,02512-00000-00005-000000,FCMI,01,02,03,,34,02R,,,,,,,False,,SAN SABA,,,,,,31727,R,APPLEGATE DOUGLAS L,,793 FM 561,,SIMMS,TX,75574,,1.000000,0,0.00,,,0.0000,AB 217 J E HOPKINS,LT 5 UN 3 TALL TREE NORTH,,,0,1100,0,0,0,0,0,0,1100,1100,0,0,0,0,0,0,0,0,0,0,0,0,0,False,0,,,1,False,False,C1,,,,False,False,,
2019,01,FRANKLIN CAD,3,01135-00000-00100-000000,FCWIC,01,02,03,15,39,02R,,,,,,,False,701,BROADWAY,W,WINNSBORO,TX,75494,,27032,R,SAFFE PROPERTY & CASUALTY LP,,2113 GREENBRIAR DRIVE #E,,SOUTHLAKE,TX,76092,,1.000000,0,0.00,,,1.5860,AB 618 W H SUMMERLIN,PT LT 21B BLK W-2,,,0,8900,0,0,0,0,0,0,194030,194030,0,0,0,0,0,0,0,0,0,0,0,185130,0,False,0,A14,,1,False,False,F1,,,ONLEY INS,False,False,,
2019,01,FRANKLIN CAD,4,02130-00000-00002-000000,FCMI,01,02,03,,34,02R,,,,,,,False,303,EL DORADO DRIVE,E,SCROGGINS,TX,75480,,30488,R,FOSTER JOHN R & SUSAN C,,523 MOCKINGBIRD DRIVE,,MURPHY,TX,75094,,1.000000,0,0.00,,171,0.0000,AB 453 A STARNS,LT 2 EL DORADO BEACH,LEASEHOLD,,178500,0,0,0,0,0,0,0,515970,515970,0,0,0,0,0,0,0,0,0,337470,0,0,0,False,0,PLT,,1,False,False,A1,,,,False,False,PARADIGM TAX GROUP,STRUCTURAL ELEVATION ; 392.651
2019,01,FRANKLIN CAD,5,02130-00000-00003-000000,FCMI,01,02,03,,34,02R,,,,,,,False,,EL DORADO DRIVE,E,SCROGGINS,TX,75480,,27229,R,TATUM DAVID & LISA,,16307 FALLKIRK DRIVE,,DALLAS,TX,75248,,1.000000,0,0.00,,111,0.0000,AB 453 A STARNS,LT 3 EL DORADO BEACH,LEASEHOLD,,185930,0,0,0,0,0,0,0,623470,623470,0,0,0,0,0,0,0,0,0,437540,0,0,0,False,0,PLT,,1,False,False,A1,,,,False,False,RETC LIMITED PARTNERSHIP,STRUCTURAL ELEVATION ; 392.651
2019,01,FRANKLIN CAD,7,00765-00000-00060-000000,FCMI,01,02,03,,34,02R,,,,,,,False,,NE 2060,CR,MOUNT VERNON,TX,75457,,15156,R,WYNN CHARLES MICHAEL,,1083 Cr Ne 2060,,Mount Vernon,TX,75457,5803,1.000000,0,0.00,,,80.6900,AB 21 J H BLUNDELL,,,,0,0,250140,3870,0,4210,0,0,264420,22360,0,0,0,0,0,0,0,0,0,0,0,14280,0,False,0,D6,,1,False,False,D1,D2,,,False,False,,
2019,01,FRANKLIN CAD,9,01200-00126-00000-000000,FCWIC,01,02,03,15,39,02R,,,,,,,False,612,WARD STREET,,WINNSBORO,TX,75494,,32897,R,KALTENHAUSER CHARLES JOHN,,612 WARD STREET,,WINNSBORO,TX,75494,,1.000000,0,0.00,,,0.2727,AB 368 J S PIPPIN,.273 AC PT LOT 7 BLK 2 HILLTOP,,,7430,0,0,0,0,0,0,0,125850,125850,0,0,0,0,0,0,0,0,0,118420,0,0,0,False,0,A14,,1,False,False,A1,,,,False,False,,
2019,01,FRANKLIN CAD,10,01090-00000-00842-000000,FCMI,01,02,03,,34,02R,,,,,,,False,632,CR 4380,SE,SCROGGINS,TX,75480,,30595,R,MCMINN MICHAEL F & SABINA L,,632 SE CR 4380,,SCROGGINS,TX,75480,,1.000000,0,0.00,,,9.6190,AB 306 J MAX,,,,0,10680,26990,780,0,0,0,0,38670,12460,0,0,0,0,0,0,0,0,0,0,0,1000,0,False,0,,,1,False,False,D1,E,D2,,False,False,,
2019,01,FRANKLIN CAD,11,01090-00000-00500-000000,FCMI,01,02,03,,34,02R,,,,,,,False,,,,,,,,16692,R,ACKER ACRES INC,,2304 Mckellar Rd,,Mount Pleasant,TX,75455,6552,1.000000,0,0.00,,,39.0000,AB 306 J MAX,,,,0,0,85800,3940,0,0,0,0,85800,3940,0,0,0,0,0,0,0,0,0,0,0,0,0,False,0,D13,,1,False,False,D1,,,,False,False,,
2019,01,FRANKLIN CAD,13,01090-00000-00510-000000,FCMI,01,02,03,,34,02R,,,,,,,False,,,,,,,,16692,R,ACKER ACRES INC,,2304 Mckellar Rd,,Mount Pleasant,TX,75455,6552,1.000000,0,0.00,,,72.1000,AB 306 J MAX,,,,0,7500,156420,7170,0,0,0,0,179420,30170,0,0,0,0,0,0,0,0,0,15500,0,0,0,False,0,D13,,1,False,False,D1,E1,,,False,False,,
2019,01,FRANKLIN CAD,14,01090-00000-00520-000000,FCMI,01,02,03,,34,02R,,,,,,,False,,,,,,,,16692,R,ACKER ACRES INC,,2304 Mckellar Rd,,Mount Pleasant,TX,75455,6552,1.000000,0,0.00,,,9.3300,AB 306 J MAX,,,,0,0,20530,940,0,0,0,0,20530,940,0,0,0,0,0,0,0,0,0,0,0,0,0,False,0,D13,,1,False,False,D1,,,,False,False,,
2019,01,FRANKLIN CAD,15,01090-00000-00902-000000,FCMI,01,02,03,,34,02R,,,,,,,False,,,,,,,,16692,R,ACKER ACRES INC,,2304 Mckellar Rd,,Mount Pleasant,TX,75455,6552,1.000000,0,0.00,,,22.6200,AB 306 J MAX,,,,0,0,49760,2280,0,0,0,0,251390,203910,0,0,0,0,0,0,0,0,0,0,0,201630,0,False,0,D13,,1,False,False,D1,D2,,,False,False,,
2019,01,FRANKLIN CAD,16,01098-00000-00280-000000,FCMI,01,02,03,,34,02R,,,,,,,False,,,,,,,,16692,R,ACKER ACRES INC,,2304 Mckellar Rd,,Mount Pleasant,TX,75455,6552,1.000000,0,0.00,,,43.4710,AB 417 C H SIMS,,,,0,0,95640,4390,0,0,0,0,95640,4390,0,0,0,0,0,0,0,0,0,0,0,0,0,False,0,D13,,1,False,False,D1,,,,False,False,,
2019,01,FRANKLIN CAD,17,01200-00188-00000-000000,FCWIC,01,02,03,15,39,02R,,,,,,,False,501,PINE,W,WINNSBORO,TX,75494,,5921,R,STOKLEY ROY B,,509 NORTH POST OAK STREET,,WINNSBORO,TX,75494,,1.000000,0,0.00,,,0.4132,AB 611 G B KING,LT 41 BROADVIEW,,,8180,0,0,0,0,0,0,0,8180,8180,0,0,0,0,0,0,0,0,0,0,0,0,0,False,0,A14,,1,False,False,A1,,,,False,False,,
2019,01,FRANKLIN CAD,18,02501-00012-00022-000000,FCMI,01,02,03,,34,02R,,,,,,,False,,,,,,,,19236,R,DENNIS VIVIAN,,333 COLLEGE ST,,SULPHUR SPRINGS,TX,75482,,1.000000,0,0.00,,,0.0000,AB 134 J DACON,LT 22 BLK 12 SEC 2 TALL TREE,,,0,2500,0,0,0,0,0,0,2500,2500,0,0,0,0,0,0,0,0,0,0,0,0,0,False,0,D11,,1,False,False,C1,,,,False,False,,LEASEHOLD
2019,01,FRANKLIN CAD,19,00019-00000-00030-000000,FCMIC,01,02,03,10,34,02R,,,,,,,False,202,MAIN,W,MOUNT VERNON,TX,75457,,2446,R,HERLOCKER J H III,,PO Box 894,,Mineola,TX,75773,0894,1.000000,0,0.00,,,0.1961,AB 425 J SLOAN,70X122,,,0,5590,0,0,0,0,0,0,55230,55230,0,0,0,0,0,0,0,0,0,0,0,49640,0,False,0,C7,,1,False,False,F1,,,LIFE FELLOWSHIP CHURCH,False,False,,
2019,01,FRANKLIN CAD,20,02370-00000-00352-000000,FCMI,01,02,03,,34,02R,,,,,,,False,10,POINT DRIVE,,MOUNT VERNON,TX,75457,,28407,R,SUMMERS VIRGIL C III & KATHY A,,P O BOX 1652,,ROCKWALL,TX,75087,,1.000000,0,0.00,H,,0.0000,AB 84 D COOTS,LT 352 PH 3 SNUG HARBOR,LEASEHOLD,,95040,0,0,0,0,0,0,0,239320,239320,0,0,0,0,0,0,0,0,0,144280,0,0,0,False,0,E11,,1,False,False,A1,,,,False,False,,STRUCTURAL ELEVATION ; 385.98
2019,01,FRANKLIN CAD,21,00093-00000-00080-000000,FCMIC,01,02,03,10,34,02R,,,,,,,False,604,LEFTWICH,,MOUNT VERNON,TX,75457,,20066,R,SEARS WALTER R SR & MARGARET,,P O BOX 2,,MOUNT VERNON,TX,75457,0002,1.000000,0,0.00,,,0.1636,AB 425 J SLOAN,LT 2 MCDONOUGH ADDN,75  X 95,,4140,0,0,0,0,0,0,0,34470,34470,0,0,0,0,0,0,0,0,0,30330,0,0,0,False,0,C7,,1,False,False,A1,,,,False,False,,
2019,01,FRANKLIN CAD,22,01090-00000-00090-000000,FCMI,01,02,03,,34,02R,,,,,,,False,,,,,,,,24516,R,RICH RANDALL L & LINDA,,132 Deer Cove Rd,,Scroggins,TX,75480,6013,1.000000,0,0.00,,,26.2800,AB 306 J MAX,,,,0,0,78840,2650,0,0,0,0,93580,17390,0,0,0,0,0,0,0,0,0,0,0,14740,0,False,0,D12,,1,False,False,D1,D2,,,False,False,,
2019,01,FRANKLIN CAD,23,01090-00000-00091-000000,FCMI,01,02,03,,34,02R,,,,,,,False,10402,FM 115,,SCROGGINS,TX,75480,,28822,R,JOHNSON RONALD J & VICTORIA D,,P O BOX 39,,SCROGGINS,TX,75480,,1.000000,0,0.00,H,,4.0000,AB 306 J MAX,LTE RONALD J & VICTORIA D JOHNSON,,,27000,0,0,0,0,0,0,0,94560,94560,0,0,0,0,0,0,0,0,0,67560,0,0,0,False,0,D12,,1,False,False,A1,,,,False,False,,
2019,01,FRANKLIN CAD,24,01092-00000-00310-000000,FCMI,01,02,03,,34,02R,,,,,,,False,,CR 4345,SE,SCROGGINS,TX,75480,,15269,R,TWINING KURT & GLENDA,,9 RYDDINGTON PLACE,,DALLAS,TX,75230,,1.000000,0,0.00,,,59.5040,AB 20 I BARRE,,,,0,0,154710,6000,0,0,0,0,154710,6000,0,0,0,0,0,0,0,0,0,0,0,0,0,False,0,D13,,1,False,False,D1,,,,False,False,,
2019,01,FRANKLIN CAD,25,00058-00000-00150-000000,FCMIC,01,02,03,10,34,02R,,,,,,,False,701,MAIN,W,MT VERNON,TX,75457,,31464,R,PRESSLEY RENTAL PROPERTIES LLC,,993 CR 4536,,WINNSBORO,TX,75494,,1.000000,0,0.00,,,0.2583,AB 425 J SLOAN,90X125,,,7270,0,0,0,0,0,0,0,46380,46380,0,0,0,0,0,0,0,0,0,39110,0,0,0,False,0,C7,,1,False,False,A1,,,,False,False,,
2019,01,FRANKLIN CAD,26,02512-00000-00028-000000,FCMI,01,02,03,,34,02R,,,,,,,False,,,,,,,,24354,R,BAUER JAMES,,189 W 300 S,,Hyde Park,UT,84318,3327,1.000000,0,0.00,,,0.0000,AB 217 J E HOPKINS,LT 28 UN 3 TALL TREE NORTH,,,0,1100,0,0,0,0,0,0,1100,1100,0,0,0,0,0,0,0,0,0,0,0,0,0,False,0,,,1,False,False,C1,,,,False,False,,
2019,01,FRANKLIN CAD,27,01200-01375-00000-000000,FCWIC,01,02,03,15,39,02R,,,,,,,False,911,BROADWAY,W,WINNSBORO,TX,75494,,20649,R,ROBINSON DAVID & JALAYNE,,810 W Pine St,,Winnsboro,TX,75494,2032,1.000000,0,0.00,,,1.0000,AB 368 J S PIPPIN,LT 2 BLK W-2,,,0,0,3000,100,0,0,0,0,3000,100,0,0,0,0,0,0,0,0,0,0,0,0,0,False,0,A14,,1,False,False,D1,,,,False,False,,
2019,01,FRANKLIN CAD,28,00103-00000-00100-000000,FCMIC,01,02,03,10,34,02R,,,,,,,False,315,SH-37,S,MOUNT VERNON,TX,75457,,29662,R,PAMPLIN EDWARD,,7452 HWY 37 NORTH,,TALCO,TX,75493,,1.000000,0,0.00,,,0.8727,AB 412 W H RAVEY,LTE CLARA CARY PAMPLIN ADAMS,,,56560,0,0,0,0,0,0,0,81970,81970,0,0,0,0,0,0,0,0,0,25410,0,0,0,False,0,C7,,1,False,False,A1,,,,False,False,,
2019,01,FRANKLIN CAD,29,02505-00000-00101-000000,FCMI,01,02,03,,34,02R,,,,,,,False,,,,,,,,11056,R,VANN LEE R JR,,18052 Martin Dr,,Conroe,TX,77302,5660,1.000000,0,0.00,,,0.0000,AB 355 J D NELSON,LT 101 TALL TREE EAST,,,0,1000,0,0,0,0,0,0,1000,1000,0,0,0,0,0,0,0,0,0,0,0,0,0,False,0,,,1,False,False,C1,,,,False,False,,
2019,01,FRANKLIN CAD,31,00056-00000-00080-000000,FCMIC,01,02,03,10,34,02R,,,,,,,False,409,MAIN,E,MT VERNON,TX,75457,,20640,R,EPPERSON KIMBERLY,,409 Main St E,,Mt Vernon,TX,75457,2503,1.000000,0,0.00,H,,0.2975,AB 270 W S KEITH,135.04 X 96.50 AVG,,,11480,0,0,0,0,0,0,0,69600,69600,0,0,0,0,0,0,0,0,0,58120,0,0,0,False,0,C7,,1,False,False,A1,,,,False,False,,
2019,01,FRANKLIN CAD,32,00723-00000-00020-000000,FCMI,01,02,03,,34,02R,,,,,,,False,1340,CR 1018,NW,MOUNT VERNON,TX,75457,,24009,R,FOWLER KIT SCOTT & ROBIN LYNN,,1340 County Road Nw 1018,,MOUNT VERNON,TX,75457,5910,1.000000,0,0.00,H,,63.7500,AB 397 P RHOADES,,,,7500,0,100400,6330,0,0,0,0,200760,106690,0,0,0,0,0,0,0,0,0,92860,0,0,0,False,0,B5,,1,False,False,D1,E1,D2,,False,False,,
2019,01,FRANKLIN CAD,33,00832-00000-00170-000000,FCMI,01,02,03,,34,02R,,,,,,,False,1175,ST HWY 67 W,,MOUNT VERNON,TX,75457,,25704,R,ROSALES ROBERT & SHARON LEANN,,P.O. BOX 483,,MOUNT VERNON,TX,75457,0483,1.000000,0,0.00,H,,13.6400,AB 480 J TRUITT,HS LINK W/ P 21811,,,7500,0,58780,1270,0,0,0,0,87660,11390,0,0,0,0,0,0,0,0,0,21380,0,0,0,False,0,B7,,1,False,True,D1,E1,,,False,False,,
2019,01,FRANKLIN CAD,34,00634-00000-00030-000000,FCMI,01,02,03,,34,02R,,,,,,,False,,,,,,,,24,R,ADAMS ZACK,,1090 Cr Ne 2220,,Talco,TX,75487,4242,1.000000,0,0.00,,,99.0000,AB 266 W KEITH,,,,0,0,178200,9990,0,0,0,0,179400,11190,0,0,0,0,0,0,0,0,0,0,0,1200,0,False,0,C4,,1,False,False,D1,D2,,,False,False,,
2019,01,FRANKLIN CAD,35,00634-00000-00031-000000,FCMI,01,02,03,,34,02R,,,,,,,False,1090,CR 2220,NE,TALCO,TX,75487,,24,R,ADAMS ZACK,,1090 Cr Ne 2220,,Talco,TX,75487,4242,1.000000,0,0.00,H,,1.0000,AB 266 WM KEITH,,,,7500,0,0,0,0,0,0,0,100050,100050,0,0,0,0,0,0,0,0,0,92550,0,0,0,False,0,C4,,1,False,False,E1,,,,False,False,,
2019,01,FRANKLIN CAD,36,02501-00010-00004-000000,FCMI,01,02,03,,34,02R,,,,,,,False,520,WHISPERING PINE TRAIL,S,MOUNT VERNON,TX,75457,,32387,R,CLOUSE CYNTHIA RAE,,707 CROSSROADS DRIVE,,HOUSTON,TX,77079,,1.000000,0,0.00,,,0.0000,AB 217 J E HOPKINS,LT 4 BLK 10 SEC 2 TALL TREE,,,51500,0,0,0,0,0,0,0,311960,311960,0,0,0,0,0,0,0,0,0,259510,950,0,0,False,0,,D11,1,False,False,A1,,,,False,False,,LEASEHOLD
2019,01,FRANKLIN CAD,37,02201-00000-00047-000000,FCMI,01,02,03,,34,02R,,,,,,,False,,,,SCROGGINS,TX,75480,,30279,R,PARNELL EDWARD ARCHER &,CARRASCOSA LYDIA,150 KING LANCE COURT,,SCROGGINS,TX,75480,,1.000000,0,0.00,,,0.0000,AB 455 T R STARNS,LT 47 SEC 2 KINGS COUNTRY,,,0,2500,0,0,0,0,0,0,2500,2500,0,0,0,0,0,0,0,0,0,0,0,0,0,False,0,D11,,1,False,False,C1,,,,False,False,,LEASEHOLD
2019,01,FRANKLIN CAD,38,02155-00000-00017-000000,FCMI,01,02,03,,34,02R,,,,,,,False,333,HICKORY HILL LN,,SCROGGINS,TX,75480,,30144,R,BEERWINKLE KENNETH,,333 HICKORY HILL LANE,,SCROGGINS,TX,75480,,1.000000,0,0.00,H,,0.0000,AB 277 WM Y LACY,LT 17R HICKORY HILLS #1,(R/P 193A),,158730,0,0,0,0,0,0,0,410390,388320,0,0,0,0,0,0,0,0,0,251660,0,0,0,False,0,193A,,1,False,False,A1,,,,False,False,,
2019,01,FRANKLIN CAD,39,00552-00000-00140-000000,FCMI,01,02,03,,34,02R,,,,,,,False,,,,,,,,28,R,AIKIN JERRY WAYNE & MABEL INEZ,,476 CR NE 2120,,TALCO,TX,75487,,1.000000,0,0.00,,,49.0000,AB 1 J ASKEY,,,,0,0,68600,4940,0,0,0,0,68600,4940,0,0,0,0,0,0,0,0,0,0,0,0,0,False,0,C2,,1,False,False,D1,,,,False,False,,
2019,01,FRANKLIN CAD,41,00462-00000-00050-000000,FCSBI,01,02,03,,38,02R,,,,,,,False,1495,CR 1081,NW,SULPHUR BLUFF,TX,75481,,23328,R,COBERLEY GREGORY DALE & EVELYN,,1495 CR NW 1081,,SULPHUR BLUFF,TX,75481,,1.000000,0,0.00,,,3.0000,AB 656 JD BLOODWORTH,,,,20500,0,0,0,0,0,0,0,50310,50310,0,0,0,0,0,0,0,0,0,29810,0,0,0,False,0,B1,,1,False,False,E1,,,,False,False,,
2019,01,FRANKLIN CAD,42,00462-00000-00010-000000,FCSBI,01,02,03,,38,02R,,,,,,,False,,,,,,,,29,R,AIKIN J W JR,,63 County Road Ne 2120,,Talco,TX,75487,4405,1.000000,0,0.00,,,10.5000,AB 656 J D BLOODWORTH,,,,0,0,36750,1060,0,0,0,0,36750,1060,0,0,0,0,0,0,0,0,0,0,0,0,0,False,0,B1,,1,False,False,D1,,,,False,False,,
2019,01,FRANKLIN CAD,43,00462-00000-00011-000000,FCSBI,01,02,03,,38,02R,,,,,,,False,,,,,,,,29,R,AIKIN J W JR,,63 County Road Ne 2120,,Talco,TX,75487,4405,1.000000,0,0.00,,,5.0000,AB 656 J D BLOODWORTH,,,,0,0,17500,500,0,0,0,0,17500,500,0,0,0,0,0,0,0,0,0,0,0,0,0,False,0,B1,,1,False,False,D1,,,,False,False,,
2019,01,FRANKLIN CAD,44,00552-00000-00150-000000,FCMI,01,02,03,,34,02R,,,,,,,False,,CR 2120,NE,TALCO,TX,75487,,28,R,AIKIN JERRY WAYNE & MABEL INEZ,,476 CR NE 2120,,TALCO,TX,75487,,1.000000,0,0.00,H,,1.0000,AB 1 J ASKEY,,,,7500,0,0,0,0,0,0,0,48550,48550,0,0,0,0,0,0,0,0,0,41050,0,0,0,False,0,C2,,1,False,False,E1,,,,False,False,,
2019,01,FRANKLIN CAD,45,00463-00000-00021-000000,FCSBI,01,02,03,,38,02R,,,,,,,False,2565,CR 1081,NW,SULPHUR BLUFF,TX,75481,,32231,R,DICKERSON RANDALL,,2565 CR NW 1081,,SULPHUR BLUFF,TX,75481,,1.000000,0,0.00,,,1.0200,AB 657 WM BECKNELL,,,,7650,0,0,0,0,0,0,0,106930,106930,0,0,0,0,0,0,0,0,0,99280,0,0,0,False,0,B1,,1,False,False,A1,,,,False,False,,
2019,01,FRANKLIN CAD,47,00068-00000-00100-000000,FCMIC,01,02,03,10,34,02R,,,,,,,False,104 A&,HOLBROOK,,MT VERNON,TX,75457,,11150,R,BOGUE PATRICIA,,106 PITTSBURG ST,,MOUNT VERNON,TX,75457,,1.000000,0,0.00,,,0.0480,AB 270 W S KEITH,,,,0,7500,0,0,0,0,0,0,51770,51770,0,0,0,0,0,0,0,0,0,0,0,44270,0,False,0,C7,,1,False,False,B2,,,,False,False,,
2019,01,FRANKLIN CAD,48,02501-00005-00053-000000,FCMI,01,02,03,,34,02R,,,,,,,False,,CYPRESS CREEK DRIVE,,MOUNT VERNON,TX,75457,,15413,R,JONES GRADY B,,203 NORTH ROBINSON STREET,,BIG SANDY,TX,75755,,1.000000,0,0.00,,,0.0000,AB 134 J DACON,LT 53 BLK 5 SEC 2 TALL TREE,,,0,2500,0,0,0,0,0,0,2500,2500,0,0,0,0,0,0,0,0,0,0,0,0,0,False,0,D11,,1,False,False,C1,,,,False,False,,
2019,01,FRANKLIN CAD,49,01200-01437-00000-000000,FCWIC,01,02,03,15,39,02R,,,,,,,False,820,BROADWAY,W,WINNSBORO,TX,75494,,17522,R,BEATY FUNERAL HOME INC,,PO Box 209,,MINEOLA,TX,75773,,1.000000,0,0.00,,,0.7220,AB 368 J S PIPPIN,LT 7B BLK X-2,,,0,7500,0,0,0,0,0,0,64890,64890,0,0,0,0,0,0,0,0,0,0,0,57390,0,False,0,A14,,1,False,False,A1,,,,False,False,,
2019,01,FRANKLIN CAD,50,00689-00000-00020-000000,FCMI,01,02,03,,34,02R,,,,,,,False,,,,,,,,30106,R,ALBERTS W DALE ETAL,,2719 MARILYN DRIVE,,TYLER,TX,75701,,1.000000,0,0.00,,,42.5000,AB 59 T L BURNS,LTE GENEVA ALBERTS,,,0,0,63750,4290,0,0,0,0,63750,4290,0,0,0,0,0,0,0,0,0,0,0,0,0,False,0,,C5,1,False,False,D1,,,,False,False,,
2019,01,FRANKLIN CAD,51,00735-00000-00030-000000,FCMI,01,02,03,,34,02R,,,,,,,False,,,,,,,,30106,R,ALBERTS W DALE ETAL,,2719 MARILYN DRIVE,,TYLER,TX,75701,,1.000000,0,0.00,,,32.3330,AB 371 T POPE,LTE GENEVA ALBERTS,,,0,0,58200,3260,0,0,0,0,58200,3260,0,0,0,0,0,0,0,0,0,0,0,0,0,False,0,51,,1,False,False,D1,,,,False,False,,
2019,01,FRANKLIN CAD,52,00735-00000-00031-000000,FCMI,01,02,03,,34,02R,,,,,,,False,3550,HWY 37 NORTH,,MOUNT VERNON,TX,75457,,30106,R,ALBERTS W DALE ETAL,,2719 MARILYN DRIVE,,TYLER,TX,75701,,1.000000,0,0.00,,,1.0000,AB 371 T POPE,LTE GENEVA ALBERTS,,,7500,0,0,0,0,0,0,0,16140,16140,0,0,0,0,0,0,0,0,0,8640,0,0,0,False,0,C5,,1,False,False,E1,,,,False,False,,
2019,01,FRANKLIN CAD,53,02201-00000-00509-000000,FCMI,01,02,03,,34,02R,,,,,,,False,804,KING LEONARD CT,,SCROGGINS,TX,75480,,26546,R,MACHAJ JEFFREY M & KATHERINE A,,9541 BRENTGATE DRIVE,,DALLAS,TX,75238,,1.000000,0,0.00,,,0.0000,AB 454 T R STARNS,LT 509R SEC 2 KINGS CO,LEASEHOLD      R/P 255B,,212910,0,0,0,0,0,0,0,520090,520090,0,0,0,0,0,0,0,0,0,307180,0,0,0,False,0,D11,,1,False,False,A1,,,,False,False,,STRUCTURAL ELEVATION ; 392.658
2019,01,FRANKLIN CAD,54,02200-00000-00818-000000,FCMI,01,02,03,,34,02R,,,,,,,False,,,,SCROGGINS,TX,75480,,11664,R,ALDERSON JERRY THOMAS,,4317 Pineridge Dr,,Garland,TX,75042,6160,1.000000,0,0.00,,,0.0000,AB 359 E W NARRAMORE,LT 818 SEC 1 KINGS CO,,,0,2500,0,0,0,0,0,0,2500,2500,0,0,0,0,0,0,0,0,0,0,0,0,0,False,0,D11,,1,False,False,C1,,,,False,False,,
2019,01,FRANKLIN CAD,55,01098-00000-00350-000000,FCMI,01,02,03,,34,02R,,,,,,,False,13827,FM 115,,SCROGGINS,TX,75480,,20169,R,BANKS DALTON & WANDA,,13827 FM 115,,SCROGGINS,TX,75480,,1.000000,0,0.00,H,,2.0000,AB 417 C H SIMS,,,,11500,0,0,0,0,0,0,0,87230,87230,0,0,0,0,0,0,0,0,0,75730,0,0,0,False,0,D14,,1,False,False,A1,,,,False,False,,
2019,01,FRANKLIN CAD,57,02500-00009-00005-000000,FCMI,01,02,03,,34,02R,,,,,,,False,,HIGH POINT TRAIL,,MOUNT VERNON,TX,75457,,31901,R,HAGGARD BILL C III & CHRISTI D,,386 SPRING CREEK DRIVE,,MOUNT VERNON,TX,75457,,1.000000,0,0.00,,,0.0000,AB 217 J E HOPKINS,LT 5 BLK 9 SEC 1 TALL TREE,,,0,2500,0,0,0,0,0,0,2500,2500,0,0,0,0,0,0,0,0,0,0,0,0,0,False,0,D11,,1,False,False,C1,,,,False,False,,
2019,01,FRANKLIN CAD,58,01092-00000-00392-000000,FCMI,01,02,03,,34,02R,,,,,,,False,,,,,,,,42,R,ALEXANDER BERT D,,4126 W Walnut St,,Garland,TX,75042,6054,1.000000,0,0.00,,,17.1570,AB 20 I BARRE,,,,0,0,60050,1730,0,0,0,0,63800,5480,0,0,0,0,0,0,0,0,0,0,0,3750,0,False,0,D13,,1,False,False,D1,D2,,,False,False,,
2019,01,FRANKLIN CAD,59,01097-00000-00163-000000,FCMI,01,02,03,,34,02R,,,,,,,False,526,CR 4430,SE,SCROGGINS,TX,75480,7331,13976,R,LANKFORD GLENDA ALEXANDER,,526 CR SE 4430,,SCROGGINS,TX,75480,7331,1.000000,0,0.00,H,,2.0000,AB 133 W DAVIS,,,,14000,0,0,0,0,0,0,0,23060,22620,0,0,0,0,0,0,0,0,0,9060,0,0,0,False,0,C14,,1,False,False,E1,,,,False,False,,
2019,01,FRANKLIN CAD,60,01097-00000-00162-000000,FCMI,01,02,03,,34,02R,,,,,,,False,,,,,,,,26191,R,ALEXANDER DONNIE,,P O BOX 125,,WINNSBORO,TX,75494,,1.000000,0,0.00,,,3.8100,AB 133 W DAVIS,,,,0,16590,0,0,0,0,0,0,16590,16590,0,0,0,0,0,0,0,0,0,0,0,0,0,False,0,C14,,1,False,False,C1,,,,False,False,,
2019,01,FRANKLIN CAD,62,00811-00000-00030-000000,FCMI,01,02,03,,34,02R,,,,,,,False,,,,,,,,21571,R,LEWIS SARAH T,,6947 ELLSWORTH AVENUE,,DALLAS,TX,75214,2733,1.000000,0,0.00,,,10.5000,AB 447 B SMITH,,,,0,0,25200,1060,0,0,0,0,25200,1060,0,0,0,0,0,0,0,0,0,0,0,0,0,False,0,,D7,1,False,False,D1,,,,False,False,,
2019,01,FRANKLIN CAD,63,00813-00000-00030-000000,FCMI,01,02,03,,34,02R,,,,,,,False,,,,,,,,21571,R,LEWIS SARAH T,,6947 ELLSWORTH AVENUE,,DALLAS,TX,75214,2733,1.000000,0,0.00,,,93.0060,AB 9 WM ARNOLD,,,,0,0,167410,9380,0,0,0,0,167410,9380,0,0,0,0,0,0,0,0,0,0,0,0,0,False,0,,D7,1,False,False,D1,,,,False,False,,
2019,01,FRANKLIN CAD,64,00814-00000-00020-000000,FCMI,01,02,03,,34,02R,,,,,,,False,,,,,,,,6552,R,WILHITE WILBUR E & JANICE E,,272 Cr Ne 2045,,Mount Vernon,TX,75457,5726,1.000000,0,0.00,,,68.4700,AB 516 A WILLIS,,,,0,0,136940,6910,0,0,0,0,140800,10770,0,0,0,0,0,0,0,0,0,0,0,3860,0,False,0,A9,,1,False,False,D1,,,,False,False,,
2019,01,FRANKLIN CAD,65,00819-00000-00050-000000,FCMI,01,02,03,,34,02R,,,,,,,False,,,,,,,,5927,R,STONE MARY IDA,,PO Box 256,,Mount Vernon,TX,75457,0256,1.000000,0,0.00,,,26.9200,AB 402 G RICHARDSON,,,,0,0,83450,2720,0,0,0,0,83450,2720,0,0,0,0,0,0,0,0,0,0,0,0,0,False,0,D7,,1,False,False,D1,,,,False,False,,
2019,01,FRANKLIN CAD,66,00822-00000-00010-000000,FCMI,01,02,03,,34,02R,,,,,,,False,,,,,,,,5927,R,STONE MARY IDA,,PO Box 256,,Mount Vernon,TX,75457,0256,1.000000,0,0.00,,,12.3710,AB 510 J URY,,,,0,0,25980,1250,0,0,0,0,27260,2530,0,0,0,0,0,0,0,0,0,0,0,1280,0,False,0,D7,,1,False,False,D1,D2,,,False,False,,
2019,01,FRANKLIN CAD,67,00822-00000-00020-000000,FCMI,01,02,03,,34,02R,,,,,,,False,,,,,,,,10987,R,LEWIS CHARLTON W SR,,6947 Ellsworth Ave,,Dallas,TX,75214,2733,1.000000,0,0.00,,,65.0000,AB 510 J URY,,,,0,0,201500,6560,0,0,0,0,201500,6560,0,0,0,0,0,0,0,0,0,0,0,0,0,False,0,D7,,1,False,False,D1,,,,False,False,,
2019,01,FRANKLIN CAD,69,01098-00000-00340-000000,FCMI,01,02,03,,34,02R,,,,,,,False,,,,,,,,31835,R,ALEXANDER DAVID BLAINE,,11 MAREE COURT,,WAXAHACHIE,TX,75165,,1.000000,0,0.00,,,4.4720,AB 417 C H SIMS,TRACT 1,,,0,0,29070,0,0,750,0,0,29070,750,0,0,0,0,0,0,0,0,0,0,0,0,0,False,0,D14,,1,False,False,D1T,,,,False,False,,
2019,01,FRANKLIN CAD,70,00797-00000-00120-000000,FCMI,01,02,03,,34,02R,,,,,,,False,,,,,,,,20919,R,EVERGREEN 2000 LLC,HARRY EARL,148 King Andrew Ct,,Scroggins,TX,75480,4402,1.000000,0,0.00,,,24.9860,AB 154 A ENGLISH,,,,0,0,77460,0,0,11390,0,0,77460,11390,0,0,0,0,0,0,0,0,0,0,0,0,0,False,0,E6,,1,False,False,D1T,,,,False,False,,
2019,01,FRANKLIN CAD,71,02502-00013-00037-000000,FCMI,01,02,03,,34,02R,,,,,,,True,,,,,,,,1841,R,FRANKLIN COUNTY WATER DIST,,P O BOX 559,,MOUNT VERNON,TX,75457,0559,1.000000,0,0.00,,,0.0000,AB 134 J DACON,LT 37 BLK 13 SEC 3 TALL TREE,,,0,2500,0,0,0,0,0,0,2500,0,0,0,0,0,0,0,0,0,0,0,0,0,0,False,0,,D11,1,False,False,XR,,,,False,False,,LEASEHOLD
2019,01,FRANKLIN CAD,72,00797-00000-00130-000000,FCMI,01,02,03,,34,02R,,,,,,,False,,,,,,,,20919,R,EVERGREEN 2000 LLC,HARRY EARL,148 King Andrew Ct,,Scroggins,TX,75480,4402,1.000000,0,0.00,,,33.5140,AB 154 A ENGLISH,,,,0,0,103890,0,0,15280,0,0,103890,15280,0,0,0,0,0,0,0,0,0,0,0,0,0,False,0,E6,,1,False,False,D1T,,,,False,False,,
2019,01,FRANKLIN CAD,73,01030-00000-00110-000000,FCMI,01,02,03,,34,02R,,,,,,,False,,,,,,,,23724,R,MCGILBERRY STEVEN C & SARAH,,5712 ROSWELL DRIVE,,PLANO,TX,75093,5935,1.000000,0,0.00,,,27.0060,AB 307 C F MCKENZIE,,,,0,0,59410,2720,0,0,0,0,59410,2720,0,0,0,0,0,0,0,0,0,0,0,0,0,False,0,E12,,1,False,False,D1,,,,False,False,,
2019,01,FRANKLIN CAD,75,01030-00000-00120-000000,FCMI,01,02,03,,34,02R,,,,,,,False,,FM 3007,,SCROGGINS,TX,75480,,21062,R,HANSEN DEAN A & EDITH V,,15118 King Rd,,Frisco,TX,75034,8796,1.000000,0,0.00,,,86.5680,AB 307 C F MCKENZIE,,,,0,0,142840,2880,0,9690,0,0,233540,103270,0,0,0,0,0,0,0,0,0,0,0,90700,0,False,0,E12,,1,False,False,D1T,D2,,,False,False,,
2019,01,FRANKLIN CAD,76,02511-00000-00361-000000,FCMI,01,02,03,,34,02R,,,,,,,False,,,,,,,,17582,R,HICKS JOHN CHARLES &,PAULA FRANCES,8090 Mavis Ave,,Waxahachie,TX,75167,9412,1.000000,0,0.00,,,0.0000,AB 217 J E HOPKINS,LT 361 UN 2 TALL TREE NORTH,,,0,1100,0,0,0,0,0,0,1100,1100,0,0,0,0,0,0,0,0,0,0,0,0,0,False,0,,,1,False,False,C1,,,,False,False,,